Reaction Details
TargetHistamine H2 receptor
LigandBDBM50413185
Substrate/Competitorn/a
Meas. Tech.ChEMBL_493054 (CHEMBL953168)
EC50 6456.54±n/a nM
Citation Ghorai, PKraus, AKeller, MGötte, CIgel, PSchneider, ESchnell, DBernhardt, GDove, SZabel, MElz, SSeifert, RBuschauer, A Acylguanidines as bioisosteres of guanidines: NG-acylated imidazolylpropylguanidines, a new class of histamine H2 receptor agonists. J Med Chem51:7193-204 (2009) 
 
Histamine H2 receptor
Name:Histamine H2 receptor
Type:G Protein-Coupled Receptor (GPCR)
Mol. Mass.:40567.22
Organism:Cavia porcellus (domestic guinea pig)
Description:For the H2 receptor-binding assays, guinea pig striatum was used.
Residue:359
BDBM50413185
NameBDBM50413185
Synonyms:CHEMBL449828
TypeSmall organic molecule
Emp. Form.C17H23N5O
Mol. Mass.313.3974
SMILESCC(CCN=C(N)NC(=O)CCc1cnc[nH]1)c1ccccc1