Reaction Details
TargetDipeptidyl peptidase 9
LigandBDBM11463
Substrate/Competitorn/a
Meas. Tech.ChEMBL_541736 (CHEMBL1023098)
IC50 2720±n/a nM
Citation Havale, SHPal, M Medicinal chemistry approaches to the inhibition of dipeptidyl peptidase-4 for the treatment of type 2 diabetes. Bioorg Med Chem17:1783-802 (2009) 
 
Dipeptidyl peptidase 9
Name:Dipeptidyl peptidase 9
Type:Enzyme
Mol. Mass.:98260.70
Organism:Homo sapiens (Human)
Description:Q86TI2
Residue:863
BDBM11463
NameBDBM11463
Synonyms:CHEMBL22310 difluorobenzenesulfonamide 1
TypeSmall organic molecule
Emp. Form.C18H24F3N3O3S
Mol. Mass.419.462
SMILES[H][C@@]1(CC[C@@H](CC1)NS(=O)(=O)c1ccc(F)cc1F)[C@H](N)C(=O)N1CC[C@H](F)C1