Reaction Details
TargetKappa-type opioid receptor
LigandBDBM50249016
Substrate/Competitorn/a
Meas. Tech.ChEMBL_543324 (CHEMBL1022994)
Ki 36±n/a nM
Citation Moynihan, HJales, ARGreedy, BMRennison, DBroadbear, JHPurington, LTraynor, JRWoods, JHLewis, JWHusbands, SM 14 beta-O-cinnamoylnaltrexone and related dihydrocodeinones are mu opioid receptor partial agonists with predominant antagonist activity. J Med Chem52:1553-7 (2009) 
 
Kappa-type opioid receptor
Name:Kappa-type opioid receptor
Type:G Protein-Coupled Receptor (GPCR)
Mol. Mass.:42648.76
Organism:Homo sapiens (Human)
Description:P41145
Residue:380
BDBM50249016
NameBDBM50249016
Synonyms:CHEMBL471543 | N-Cyclopropylmethyl-14beta-4'-methylcinnamoyloxy-7,8-dihydrocodeinone
TypeSmall organic molecule
Emp. Form.C31H33NO5
Mol. Mass.499.5974
SMILESCOc1ccc2C[C@H]3N(CC4CC4)CC[C@@]45[C@@H](Oc1c24)C(=O)CC[C@@]35OC(=O)\C=C\c1ccc(C)cc1