Reaction Details
TargetMu-type opioid receptor
LigandBDBM50248991
Substrate/Competitorn/a
Meas. Tech.ChEMBL_543322 (CHEMBL1022992)
Ki 2.5±n/a nM
Citation Moynihan, HJales, ARGreedy, BMRennison, DBroadbear, JHPurington, LTraynor, JRWoods, JHLewis, JWHusbands, SM 14 beta-O-cinnamoylnaltrexone and related dihydrocodeinones are mu opioid receptor partial agonists with predominant antagonist activity. J Med Chem52:1553-7 (2009) 
 
Mu-type opioid receptor
Name:Mu-type opioid receptor
Type:G Protein-Coupled Receptor (GPCR)
Mol. Mass.:44789.51
Organism:Homo sapiens (Human)
Description:P35372
Residue:400
BDBM50248991
NameBDBM50248991
Synonyms:CHEMBL474755 | N-Cyclopropylmethyl-14beta-cinnamoyloxy-7,8-dihydrocodeinone
TypeSmall organic molecule
Emp. Form.C30H31NO5
Mol. Mass.485.5708
SMILESCOc1ccc2C[C@H]3N(CC4CC4)CC[C@@]45[C@@H](Oc1c24)C(=O)CC[C@@]35OC(=O)\C=C\c1ccccc1