Reaction Details
TargetPotassium voltage-gated channel subfamily H member 2
LigandBDBM50017376
Substrate/Competitorn/a
Meas. Tech.ChEMBL_541583 (CHEMBL1011672)
IC50 30±n/a nM
Citation Imai, YNRyu, SOiki, S Docking model of drug binding to the human ether-à-go-go potassium channel guided by tandem dimer mutant patch-clamp data: a synergic approach. J Med Chem52:1630-8 (2009) 
 
Potassium voltage-gated channel subfamily H member 2
Name:Potassium voltage-gated channel subfamily H member 2
Type:Multi-pass membrane protein
Mol. Mass.:126672.65
Organism:Homo sapiens (Human)
Description:Q12809
Residue:1159
BDBM50017376
NameBDBM50017376
Synonyms:(+/-)1-(4-tert-butylphenyl)-4-(4-(hydroxydiphenylmethyl)piperidin-1-yl)butan-1-ol 1-(4-tert-Butyl-phenyl)-4-[4-(hydroxy-diphenyl-methyl)-piperidin-1-yl]-butan-1-ol(Terfenadine) CHEMBL17157 teraenadine
TypeSmall organic molecule
Emp. Form.C32H41NO2
Mol. Mass.471.6734
SMILESCC(C)(C)c1ccc(cc1)C(O)CCCN1CCC(CC1)C(O)(c1ccccc1)c1ccccc1