Reaction Details
Target11-beta-hydroxysteroid dehydrogenase 1
LigandBDBM50243635
Substrate/Competitorn/a
Meas. Tech.ChEMBL_543487 (CHEMBL1018653)
IC50 0.76±n/a nM
Citation McMinn, DLRew, YSudom, ACaille, SDegraffenreid, MHe, XHungate, RJiang, BJaen, JJulian, LDKaizerman, JNovak, PSun, DTu, HUrsu, SWalker, NPYan, XYe, QWang, ZPowers, JP Optimization of novel di-substituted cyclohexylbenzamide derivatives as potent 11 beta-HSD1 inhibitors. Bioorg Med Chem Lett19:1446-50 (2009) 
 
11-beta-hydroxysteroid dehydrogenase 1
Name:11-beta-hydroxysteroid dehydrogenase 1
Type:Enzyme
Mol. Mass.:32409.16
Organism:Homo sapiens (Human)
Description:P28845
Residue:292
BDBM50243635
NameBDBM50243635
Synonyms:(S)-N-[trans-4-(4-Cyanophenyl)cyclohexyl]-4-[1,1,1-trifluoro-2-hydroxypropan-2-yl]-N-cyclopropylbenzamide N-((1r,4S)-4-(4-cyanophenyl)cyclohexyl)-N-cyclopropyl-4-((S)-1,1,1-trifluoro-2-hydroxypropan-2-yl)benzamide
TypeSmall organic molecule
Emp. Form.C26H27F3N2O2
Mol. Mass.456.5
SMILESC[C@](O)(c1ccc(cc1)C(=O)N(C1CC1)[C@H]1CC[C@@H](CC1)c1ccc(cc1)C#N)C(F)(F)F