Reaction Details
Target11-beta-hydroxysteroid dehydrogenase 1
LigandBDBM50413277
Substrate/Competitorn/a
Meas. Tech.ChEMBL_543487 (CHEMBL1018653)
IC50 1.6±n/a nM
Citation McMinn, DLRew, YSudom, ACaille, SDegraffenreid, MHe, XHungate, RJiang, BJaen, JJulian, LDKaizerman, JNovak, PSun, DTu, HUrsu, SWalker, NPYan, XYe, QWang, ZPowers, JP Optimization of novel di-substituted cyclohexylbenzamide derivatives as potent 11 beta-HSD1 inhibitors. Bioorg Med Chem Lett19:1446-50 (2009) 
 
11-beta-hydroxysteroid dehydrogenase 1
Name:11-beta-hydroxysteroid dehydrogenase 1
Type:Enzyme
Mol. Mass.:32409.16
Organism:Homo sapiens (Human)
Description:P28845
Residue:292
BDBM50413277
NameBDBM50413277
Synonyms:CHEMBL2021496
TypeSmall organic molecule
Emp. Form.C25H29F3N2O
Mol. Mass.430.5058
SMILESC[C@@](O)(c1ccc(cc1)C(=C)N(C1CC1)[C@H]1CC[C@H](CC1)c1ccccn1)C(F)(F)F