Reaction Details
TargetCarbonic anhydrase 3
LigandBDBM50248167
Substrate/Competitorn/a
Meas. Tech.ChEMBL_565856 (CHEMBL959279)
Ki 34500±n/a nM
Citation Crocetti, LMaresca, ATemperini, CHall, RAScozzafava, AMühlschlegel, FASupuran, CT A thiabendazole sulfonamide shows potent inhibitory activity against mammalian and nematode alpha-carbonic anhydrases. Bioorg Med Chem Lett19:1371-5 (2009) 
 
Carbonic anhydrase 3
Name:Carbonic anhydrase 3
Type:Enzyme
Mol. Mass.:29562.11
Organism:Homo sapiens (Human)
Description:Human cloned isozyme.
Residue:260
BDBM50248167
NameBDBM50248167
Synonyms:2-(1,3-thiazol-4-yl)-1H-benzimidazole-5-sulfonamide CHEMBL455271
TypeSmall organic molecule
Emp. Form.C10H8N4O2S2
Mol. Mass.280.326
SMILESNS(=O)(=O)c1ccc2nc([nH]c2c1)-c1cscn1