Reaction Details
TargetCarbonic anhydrase 5B, mitochondrial
LigandBDBM50248167
Substrate/Competitorn/a
Meas. Tech.ChEMBL_565859 (CHEMBL959282)
Ki 40.9±n/a nM
Citation Crocetti, LMaresca, ATemperini, CHall, RAScozzafava, AMühlschlegel, FASupuran, CT A thiabendazole sulfonamide shows potent inhibitory activity against mammalian and nematode alpha-carbonic anhydrases. Bioorg Med Chem Lett19:1371-5 (2009) 
 
Carbonic anhydrase 5B, mitochondrial
Name:Carbonic anhydrase 5B, mitochondrial
Type:Enzyme
Mol. Mass.:36440.83
Organism:Homo sapiens (Human)
Description:Human (cloned) isozyme
Residue:317
BDBM50248167
NameBDBM50248167
Synonyms:2-(1,3-thiazol-4-yl)-1H-benzimidazole-5-sulfonamide CHEMBL455271
TypeSmall organic molecule
Emp. Form.C10H8N4O2S2
Mol. Mass.280.326
SMILESNS(=O)(=O)c1ccc2nc([nH]c2c1)-c1cscn1