Reaction Details
TargetCarbonic anhydrase 14
LigandBDBM25904
Substrate/Competitorn/a
Meas. Tech.ChEMBL_565865 (CHEMBL959288)
Ki 48±n/a nM
Citation Crocetti, LMaresca, ATemperini, CHall, RAScozzafava, AMühlschlegel, FASupuran, CT A thiabendazole sulfonamide shows potent inhibitory activity against mammalian and nematode alpha-carbonic anhydrases. Bioorg Med Chem Lett19:1371-5 (2009) 
 
Carbonic anhydrase 14
Name:Carbonic anhydrase 14
Type:Enzyme
Mol. Mass.:37665.67
Organism:Homo sapiens (Human)
Description:Human (cloned) isozyme.
Residue:337
BDBM25904
NameBDBM25904
Synonyms:2-(hydrazinecarbonyl)-3-phenyl-1H-indole-5-sulfonamide CHEMBL262628 | indole sulfonamide, L
TypeSmall organic molecule
Emp. Form.C15H14N4O3S
Mol. Mass.330.362
SMILESNNC(=O)c1[nH]c2ccc(cc2c1-c1ccccc1)S(N)(=O)=O