Reaction Details
TargetD(3) dopamine receptor
LigandBDBM50378008
Substrate/Competitorn/a
Meas. Tech.ChEMBL_563523 (CHEMBL961810)
Ki 1.2±n/a nM
Citation Newman, AHGrundt, PCyriac, GDeschamps, JRTaylor, MKumar, RHo, DLuedtke, RR N-(4-(4-(2,3-dichloro- or 2-methoxyphenyl)piperazin-1-yl)butyl)heterobiarylcarboxamides with functionalized linking chains as high affinity and enantioselective D3 receptor antagonists. J Med Chem52:2559-70 (2009) 
 
D(3) dopamine receptor
Name:D(3) dopamine receptor
Type:n/a
Mol. Mass.:44243.43
Organism:Homo sapiens (Human)
Description:n/a
Residue:400
BDBM50378008
NameBDBM50378008
Synonyms:CHEMBL1627314
TypeSmall organic molecule
Emp. Form.C24H28Cl2N4O3
Mol. Mass.491.41
SMILESCOc1ccc2[nH]c(cc2c1)C(=O)NCCC(O)CN1CCN(CC1)c1cccc(Cl)c1Cl