Reaction Details
TargetD(3) dopamine receptor
LigandBDBM50378011
Substrate/Competitorn/a
Meas. Tech.ChEMBL_563523 (CHEMBL961810)
Ki 2.41±n/a nM
Citation Newman, AHGrundt, PCyriac, GDeschamps, JRTaylor, MKumar, RHo, DLuedtke, RR N-(4-(4-(2,3-dichloro- or 2-methoxyphenyl)piperazin-1-yl)butyl)heterobiarylcarboxamides with functionalized linking chains as high affinity and enantioselective D3 receptor antagonists. J Med Chem52:2559-70 (2009) 
 
D(3) dopamine receptor
Name:D(3) dopamine receptor
Type:n/a
Mol. Mass.:44243.43
Organism:Homo sapiens (Human)
Description:n/a
Residue:400
BDBM50378011
NameBDBM50378011
Synonyms:CHEMBL1627311
TypeSmall organic molecule
Emp. Form.C24H29FN4O3
Mol. Mass.440.5105
SMILESCOc1ccccc1N1CCN(CC(O)CCNC(=O)c2cc3cc(F)ccc3[nH]2)CC1