Reaction Details
TargetD(3) dopamine receptor
LigandBDBM50161229
Substrate/Competitorn/a
Meas. Tech.ChEMBL_563523 (CHEMBL961810)
Ki 2.11±n/a nM
Citation Newman, AHGrundt, PCyriac, GDeschamps, JRTaylor, MKumar, RHo, DLuedtke, RR N-(4-(4-(2,3-dichloro- or 2-methoxyphenyl)piperazin-1-yl)butyl)heterobiarylcarboxamides with functionalized linking chains as high affinity and enantioselective D3 receptor antagonists. J Med Chem52:2559-70 (2009) 
 
D(3) dopamine receptor
Name:D(3) dopamine receptor
Type:n/a
Mol. Mass.:44243.43
Organism:Homo sapiens (Human)
Description:n/a
Residue:400
BDBM50161229
NameBDBM50161229
Synonyms:Benzofuran-2-carboxylic acid {4-[4-(2,3-dichloro-phenyl)-piperazin-1-yl]-but-2-enyl}-amide | CHEMBL366904
TypeSmall organic molecule
Emp. Form.C23H23Cl2N3O2
Mol. Mass.444.354
SMILESClc1cccc(N2CCN(C\C=C\CNC(=O)c3cc4ccccc4o3)CC2)c1Cl