Reaction Details
TargetD(3) dopamine receptor
LigandBDBM50149708
Substrate/Competitorn/a
Meas. Tech.ChEMBL_563523 (CHEMBL961810)
Ki 0.72±n/a nM
Citation Newman, AHGrundt, PCyriac, GDeschamps, JRTaylor, MKumar, RHo, DLuedtke, RR N-(4-(4-(2,3-dichloro- or 2-methoxyphenyl)piperazin-1-yl)butyl)heterobiarylcarboxamides with functionalized linking chains as high affinity and enantioselective D3 receptor antagonists. J Med Chem52:2559-70 (2009) 
 
D(3) dopamine receptor
Name:D(3) dopamine receptor
Type:n/a
Mol. Mass.:44243.43
Organism:Homo sapiens (Human)
Description:n/a
Residue:400
BDBM50149708
NameBDBM50149708
Synonyms:5-Iodo-benzofuran-2-carboxylic acid {4-[4-(2-methoxy-phenyl)-piperazin-1-yl]-butyl}-amide CHEMBL182379
TypeSmall organic molecule
Emp. Form.C24H28IN3O3
Mol. Mass.533.4019
SMILESCOc1ccccc1N1CCN(CCCCNC(=O)c2cc3cc(I)ccc3o2)CC1