Reaction Details
TargetD(3) dopamine receptor
LigandBDBM50129425
Substrate/Competitorn/a
Meas. Tech.ChEMBL_563523 (CHEMBL961810)
Ki 0.52±n/a nM
Citation Newman, AHGrundt, PCyriac, GDeschamps, JRTaylor, MKumar, RHo, DLuedtke, RR N-(4-(4-(2,3-dichloro- or 2-methoxyphenyl)piperazin-1-yl)butyl)heterobiarylcarboxamides with functionalized linking chains as high affinity and enantioselective D3 receptor antagonists. J Med Chem52:2559-70 (2009) 
 
D(3) dopamine receptor
Name:D(3) dopamine receptor
Type:n/a
Mol. Mass.:44243.43
Organism:Homo sapiens (Human)
Description:n/a
Residue:400
BDBM50129425
NameBDBM50129425
Synonyms:5-Fluoro-1H-indole-2-carboxylic acid {4-[4-(2,3-dichloro-phenyl)-piperazin-1-yl]-butyl}-amide N-(4-(4-(2,3-dichlorophenyl)piperazin-1-yl)butyl)-5-fluoro-1H-indole-2-carboxamide
TypeSmall organic molecule
Emp. Form.C23H25Cl2FN4O
Mol. Mass.463.375
SMILESFc1ccc2[nH]c(cc2c1)C(=O)NCCCCN1CCN(CC1)c1cccc(Cl)c1Cl