Reaction Details
TargetATP-dependent translocase ABCB1
LigandBDBM4685
Substrate/Competitorn/a
Meas. Tech.ChEMBL_564893 (CHEMBL955890)
IC50 24100±n/a nM
Citation Tong, LPhan, TKRobinson, KLBabusis, DStrab, RBhoopathy, SHidalgo, IJRhodes, GRRay, AS Effects of human immunodeficiency virus protease inhibitors on the intestinal absorption of tenofovir disoproxil fumarate in vitro. Antimicrob Agents Chemother51:3498-504 (2007) 
 
ATP-dependent translocase ABCB1
Name:ATP-dependent translocase ABCB1
Type:Protein
Mol. Mass.:141503.50
Organism:Homo sapiens (Human)
Description:P08183
Residue:1280
BDBM4685
NameBDBM4685
Synonyms:(3R,3aS,6aR)-hexahydrofuro[2,3-b]furan-3-yl N-[(2S,3R)-4-[2H-1,3-benzodioxole-5-(2-methylpropyl)sulfonamido]-3-hydroxy-1-{4-[(2-methyl-1,3-thiazol-4-yl)methoxy]phenyl}butan-2-yl]carbamate GW0385 | [3H]GW0385
TypeSmall organic molecule
Emp. Form.C33H41N3O10S2
Mol. Mass.703.823
SMILES[H][C@]12OCC[C@@]1([H])[C@H](CO2)OC(=O)N[C@@H](Cc1ccc(OCc2csc(C)n2)cc1)[C@H](O)CN(CC(C)C)S(=O)(=O)c1ccc2OCOc2c1