Reaction Details
TargetATP-dependent translocase ABCB1
LigandBDBM519
Substrate/Competitorn/a
Meas. Tech.ChEMBL_564893 (CHEMBL955890)
IC50 100000±n/a nM
Citation Tong, LPhan, TKRobinson, KLBabusis, DStrab, RBhoopathy, SHidalgo, IJRhodes, GRRay, AS Effects of human immunodeficiency virus protease inhibitors on the intestinal absorption of tenofovir disoproxil fumarate in vitro. Antimicrob Agents Chemother51:3498-504 (2007) 
 
ATP-dependent translocase ABCB1
Name:ATP-dependent translocase ABCB1
Type:Protein
Mol. Mass.:141503.50
Organism:Homo sapiens (Human)
Description:P08183
Residue:1280
BDBM519
NameBDBM519
Synonyms:(2S)-N-[(2S,3R)-4-[(3S,4aS,8aS)-3-(tert-butylcarbamoyl)-decahydroisoquinolin-2-yl]-3-hydroxy-1-phenylbutan-2-yl]-2-(quinolin-2-ylformamido)butanediamide Fortovase Ro 31-8959 Saquinavir
TypeSmall organic molecule
Emp. Form.C38H50N6O5
Mol. Mass.670.8408
SMILESCC(C)(C)NC(=O)[C@@H]1C[C@@H]2CCCC[C@@H]2CN1C[C@@H](O)[C@H](Cc1ccccc1)NC(=O)[C@H](CC(N)=O)NC(=O)c1ccc2ccccc2n1