Reaction Details
TargetATP-dependent translocase ABCB1
LigandBDBM577
Substrate/Competitorn/a
Meas. Tech.ChEMBL_564893 (CHEMBL955890)
IC50>100000±n/a nM
Citation Tong, LPhan, TKRobinson, KLBabusis, DStrab, RBhoopathy, SHidalgo, IJRhodes, GRRay, AS Effects of human immunodeficiency virus protease inhibitors on the intestinal absorption of tenofovir disoproxil fumarate in vitro. Antimicrob Agents Chemother51:3498-504 (2007) 
 
ATP-dependent translocase ABCB1
Name:ATP-dependent translocase ABCB1
Type:Protein
Mol. Mass.:141503.50
Organism:Homo sapiens (Human)
Description:P08183
Residue:1280
BDBM577
NameBDBM577
Synonyms:(3S)-oxolan-3-yl N-[(2S,3R)-4-[(4-aminobenzene)(2-methylpropyl)sulfonamido]-3-hydroxy-1-phenylbutan-2-yl]carbamate APV Amprenavir CHEMBL116 | VX-478
TypeSmall organic molecule
Emp. Form.C25H35N3O6S
Mol. Mass.505.627
SMILESCC(C)CN(C[C@@H](O)[C@H](Cc1ccccc1)NC(=O)O[C@H]1CCOC1)S(=O)(=O)c1ccc(N)cc1