Reaction Details
TargetMu-type opioid receptor
LigandBDBM50216142
Substrate/Competitorn/a
Meas. Tech.ChEMBL_563706 (CHEMBL992670)
Ki>1000±n/a nM
Citation Yang, LXu, WChen, FLiu-Chen, LYMa, ZLee, DY Synthesis and biological evaluation of C-12 triazole and oxadiazole analogs of salvinorin A. Bioorg Med Chem Lett19:1301-4 (2009) 
 
Mu-type opioid receptor
Name:Mu-type opioid receptor
Type:G Protein-Coupled Receptor (GPCR)
Mol. Mass.:44503.11
Organism:Rattus norvegicus (rat)
Description:Competition binding assays were carried out using membrane preparations from transfected HN9.10 cells that constitutively expressed the mu opioid receptor.
Residue:398
BDBM50216142
NameBDBM50216142
Synonyms:(2S,4aR,6aR,7R,9S,10aS,10bR)-methyl 9-acetoxy-6a,10b-dimethyl-2-(3-methyl-1,2,4-oxadiazol-5-yl)-4,10-dioxo-dodecahydro-1H-benzo[f]isochromene-7-carboxylate CHEMBL210564
TypeSmall organic molecule
Emp. Form.C22H28N2O8
Mol. Mass.448.4663
SMILESCOC(=O)[C@@H]1C[C@H](OC(C)=O)C(=O)[C@H]2[C@@]1(C)CC[C@H]1C(=O)O[C@@H](C[C@]21C)c1nc(C)no1