Reaction Details
TargetDelta-type opioid receptor
LigandBDBM50266960
Substrate/Competitorn/a
Meas. Tech.ChEMBL_563707 (CHEMBL992671)
Ki>1000±n/a nM
Citation Yang, LXu, WChen, FLiu-Chen, LYMa, ZLee, DY Synthesis and biological evaluation of C-12 triazole and oxadiazole analogs of salvinorin A. Bioorg Med Chem Lett19:1301-4 (2009) 
 
Delta-type opioid receptor
Name:Delta-type opioid receptor
Type:Enzyme Catalytic Domain
Mol. Mass.:40577.25
Organism:MOUSE
Description:P32300
Residue:372
BDBM50266960
NameBDBM50266960
Synonyms:(2S,4aR,6aR,7R,9S,10aS,10bR)-methyl 9-acetoxy-2-(1-ethyl-1H-1,2,3-triazol-4-yl)-6a,10b-dimethyl-4,10-dioxododecahydro-1H-benzo[f]isochromene-7-carboxylate | CHEMBL514358
TypeSmall organic molecule
Emp. Form.C23H31N3O7
Mol. Mass.461.5081
SMILESCCn1cc(nn1)[C@@H]1C[C@@]2(C)[C@@H](CC[C@@]3(C)[C@@H](C[C@H](OC(C)=O)C(=O)[C@H]23)C(=O)OC)C(=O)O1