Reaction Details
TargetKappa-type opioid receptor
LigandBDBM50266962
Substrate/Competitorn/a
Meas. Tech.ChEMBL_563708 (CHEMBL992672)
Ki>1000±n/a nM
Citation Yang, LXu, WChen, FLiu-Chen, LYMa, ZLee, DY Synthesis and biological evaluation of C-12 triazole and oxadiazole analogs of salvinorin A. Bioorg Med Chem Lett19:1301-4 (2009) 
 
Kappa-type opioid receptor
Name:Kappa-type opioid receptor
Type:G Protein-Coupled Receptor (GPCR)
Mol. Mass.:42648.76
Organism:Homo sapiens (Human)
Description:P41145
Residue:380
BDBM50266962
NameBDBM50266962
Synonyms:(2S,4aR,6aR,7R,9S,10aS,10bR)-methyl 9-acetoxy-6a,10b-dimethyl-4,10-dioxo-2-(1-(pivaloyloxymethyl)-1H-1,2,3-triazol-4-yl)dodecahydro-1H-benzo[f]isochromene-7-carboxylate | CHEMBL474477
TypeSmall organic molecule
Emp. Form.C27H37N3O9
Mol. Mass.547.5974
SMILESCOC(=O)[C@@H]1C[C@H](OC(C)=O)C(=O)[C@H]2[C@@]1(C)CC[C@H]1C(=O)O[C@@H](C[C@]21C)c1cn(COC(=O)C(C)(C)C)nn1