Reaction Details
TargetMu-type opioid receptor
LigandBDBM50266990
Substrate/Competitorn/a
Meas. Tech.ChEMBL_563706 (CHEMBL992670)
Ki>1000±n/a nM
Citation Yang, LXu, WChen, FLiu-Chen, LYMa, ZLee, DY Synthesis and biological evaluation of C-12 triazole and oxadiazole analogs of salvinorin A. Bioorg Med Chem Lett19:1301-4 (2009) 
 
Mu-type opioid receptor
Name:Mu-type opioid receptor
Type:G Protein-Coupled Receptor (GPCR)
Mol. Mass.:44503.11
Organism:Rattus norvegicus (rat)
Description:Competition binding assays were carried out using membrane preparations from transfected HN9.10 cells that constitutively expressed the mu opioid receptor.
Residue:398
BDBM50266990
NameBDBM50266990
Synonyms:(2S,4aR,6aR,7R,9S,10aS,10bR)-methyl 9-acetoxy-6a,10b-dimethyl-4,10-dioxo-2-(1H-1,2,3-triazol-4-yl)dodecahydro-1H-benzo[f]isochromene-7-carboxylate | CHEMBL478509
TypeSmall organic molecule
Emp. Form.C21H27N3O7
Mol. Mass.433.455
SMILESCOC(=O)[C@@H]1C[C@H](OC(C)=O)C(=O)[C@H]2[C@@]1(C)CC[C@H]1C(=O)O[C@@H](C[C@]21C)c1cnn[nH]1