Reaction Details
TargetKappa-type opioid receptor
LigandBDBM50367123
Substrate/Competitorn/a
Meas. Tech.ChEMBL_563708 (CHEMBL992672)
Ki 0.5±n/a nM
Citation Yang, LXu, WChen, FLiu-Chen, LYMa, ZLee, DY Synthesis and biological evaluation of C-12 triazole and oxadiazole analogs of salvinorin A. Bioorg Med Chem Lett19:1301-4 (2009) 
 
Kappa-type opioid receptor
Name:Kappa-type opioid receptor
Type:G Protein-Coupled Receptor (GPCR)
Mol. Mass.:42648.76
Organism:Homo sapiens (Human)
Description:P41145
Residue:380
BDBM50367123
NameBDBM50367123
Synonyms:ETORPHINE | M99
TypeSmall organic molecule
Emp. Form.C24H31NO4
Mol. Mass.397.5072
SMILESCCC[C@](C)(O)[C@H]1C[C@]23C=C[C@]1(O)[C@@H]1Oc4c5c(C[C@H]2N(C)CC[C@@]315)ccc4O