Reaction Details
TargetMu-type opioid receptor
LigandBDBM50266888
Substrate/Competitorn/a
Meas. Tech.ChEMBL_563750 (CHEMBL993513)
Ki 2.7±n/a nM
Citation Li, GAschenbach, LCHe, HSelley, DEZhang, Y 14-O-Heterocyclic-substituted naltrexone derivatives as non-peptide mu opioid receptor selective antagonists: design, synthesis, and biological studies. Bioorg Med Chem Lett19:1825-9 (2009) 
 
Mu-type opioid receptor
Name:Mu-type opioid receptor
Type:G Protein-Coupled Receptor (GPCR)
Mol. Mass.:44789.51
Organism:Homo sapiens (Human)
Description:P35372
Residue:400
BDBM50266888
NameBDBM50266888
Synonyms:(1S,5R,13R,17S)-4-(cyclopropylmethyl)-10-hydroxy-14-oxo-12-oxa-4-azapentacyclo[9.6.1.0^{1,13}.0^{5,17}.0^{7,18}]octadeca-7(18),8,10-trien-17-yl quinoline-3-carboxylate | CHEMBL473253
TypeSmall organic molecule
Emp. Form.C30H28N2O5
Mol. Mass.496.5537
SMILESOc1ccc2C[C@H]3N(CC4CC4)CC[C@@]45[C@@H](Oc1c24)C(=O)CC[C@@]35OC(=O)c1cnc2ccccc2c1