Reaction Details
TargetKappa-type opioid receptor
LigandBDBM50266827
Substrate/Competitorn/a
Meas. Tech.ChEMBL_563752 (CHEMBL993515)
Ki 1013±n/a nM
Citation Li, GAschenbach, LCHe, HSelley, DEZhang, Y 14-O-Heterocyclic-substituted naltrexone derivatives as non-peptide mu opioid receptor selective antagonists: design, synthesis, and biological studies. Bioorg Med Chem Lett19:1825-9 (2009) 
 
Kappa-type opioid receptor
Name:Kappa-type opioid receptor
Type:G Protein-Coupled Receptor (GPCR)
Mol. Mass.:42648.76
Organism:Homo sapiens (Human)
Description:P41145
Residue:380
BDBM50266827
NameBDBM50266827
Synonyms:CHEMBL500766 | D-Phe-Cys-Tyr-D-Trp-Arg-Thr-Pen-Thr
TypeSmall organic molecule
Emp. Form.C51H70N12O12S2
Mol. Mass.1107.305
SMILESC[C@@H](O)[C@H](NC(=O)[C@H](NC(=O)[C@@H](NC(=O)[C@H](CCCN=C(N)N)NC(=O)[C@H](Cc1c[nH]c2ccccc12)NC(=O)[C@@H](Cc1ccc(O)cc1)NC(=O)[C@H](CS)NC(=O)[C@H](N)Cc1ccccc1)[C@@H](C)O)C(C)(C)S)C(O)=O