Reaction Details
TargetTranslocator protein
LigandBDBM50266862
Substrate/Competitorn/a
Meas. Tech.ChEMBL_563773 (CHEMBL993536)
Ki 1.34±n/a nM
Citation Yanamoto, KKumata, KYamasaki, TOdawara, CKawamura, KYui, JHatori, ASuzuki, KZhang, MR [18F]FEAC and [18F]FEDAC: Two novel positron emission tomography ligands for peripheral-type benzodiazepine receptor in the brain. Bioorg Med Chem Lett19:1707-10 (2009) 
 
Translocator protein
Name:Translocator protein
Type:Mitochondrion membrane protein
Mol. Mass.:18945.84
Organism:Rattus norvegicus (rat)
Description:Competitive binding experiments were performed on rat kidney mitochondrial membranes.
Residue:169
BDBM50266862
NameBDBM50266862
Synonyms:CHEMBL476607 | N-benzyl-2-(7-(2-fluoroethyl)-8-oxo-2-phenyl-7H-purin-9(8H)-yl)-N-methylacetamide
TypeSmall organic molecule
Emp. Form.C23H22FN5O2
Mol. Mass.419.4515
SMILESCN(Cc1ccccc1)C(=O)Cn1c2nc(ncc2n(CCF)c1=O)-c1ccccc1