Reaction Details
TargetTranslocator protein
LigandBDBM50266863
Substrate/Competitorn/a
Meas. Tech.ChEMBL_563773 (CHEMBL993536)
Ki 0.51±n/a nM
Citation Yanamoto, KKumata, KYamasaki, TOdawara, CKawamura, KYui, JHatori, ASuzuki, KZhang, MR [18F]FEAC and [18F]FEDAC: Two novel positron emission tomography ligands for peripheral-type benzodiazepine receptor in the brain. Bioorg Med Chem Lett19:1707-10 (2009) 
 
Translocator protein
Name:Translocator protein
Type:Mitochondrion membrane protein
Mol. Mass.:18945.84
Organism:Rattus norvegicus (rat)
Description:Competitive binding experiments were performed on rat kidney mitochondrial membranes.
Residue:169
BDBM50266863
NameBDBM50266863
Synonyms:CHEMBL476811 | N-benzyl-N-(2-fluoroethyl)-2-(7-methyl-8-oxo-2-phenyl-7H-purin-9(8H)-yl)acetamide
TypeSmall organic molecule
Emp. Form.C23H22FN5O2
Mol. Mass.419.4515
SMILESCn1c2cnc(nc2n(CC(=O)N(CCF)Cc2ccccc2)c1=O)-c1ccccc1