Reaction Details
TargetCannabinoid receptor 2
LigandBDBM50278519
Substrate/Competitorn/a
Meas. Tech.ChEMBL_565045 (CHEMBL959188)
Ki>10000±n/a nM
Citation Behrenswerth, AVolz, NToräng, JHinz, SBräse, SMüller, CE Synthesis and pharmacological evaluation of coumarin derivatives as cannabinoid receptor antagonists and inverse agonists. Bioorg Med Chem17:2842-51 (2009) 
 
Cannabinoid receptor 2
Name:Cannabinoid receptor 2
Type:G Protein-Coupled Receptor (GPCR)
Mol. Mass.:39690.94
Organism:Homo sapiens (Human)
Description:P34972
Residue:360
BDBM50278519
NameBDBM50278519
Synonyms:2-(2-hydroxybenzylidene)-2,3,4,4a-tetrahydro-1H-xanthen-1-one | CHEMBL470820
TypeSmall organic molecule
Emp. Form.C20H16O3
Mol. Mass.304.3392
SMILESOc1ccccc1\C=C1/CCC2Oc3ccccc3C=C2C1=O