Reaction Details
TargetCannabinoid receptor 2
LigandBDBM50278471
Substrate/Competitorn/a
Meas. Tech.ChEMBL_565045 (CHEMBL959188)
Ki 2780±n/a nM
Citation Behrenswerth, AVolz, NToräng, JHinz, SBräse, SMüller, CE Synthesis and pharmacological evaluation of coumarin derivatives as cannabinoid receptor antagonists and inverse agonists. Bioorg Med Chem17:2842-51 (2009) 
 
Cannabinoid receptor 2
Name:Cannabinoid receptor 2
Type:G Protein-Coupled Receptor (GPCR)
Mol. Mass.:39690.94
Organism:Homo sapiens (Human)
Description:P34972
Residue:360
BDBM50278471
NameBDBM50278471
Synonyms:3-(2,4-Dimethoxybenzyl)-5-methoxy-7-methyl-2Hchromen-2-one | CHEMBL470016
TypeSmall organic molecule
Emp. Form.C20H20O5
Mol. Mass.340.3698
SMILESCOc1ccc(Cc2cc3c(OC)cc(C)cc3oc2=O)c(OC)c1