Reaction Details
TargetCannabinoid receptor 2
LigandBDBM50278426
Substrate/Competitorn/a
Meas. Tech.ChEMBL_565045 (CHEMBL959188)
Ki 1030±n/a nM
Citation Behrenswerth, AVolz, NToräng, JHinz, SBräse, SMüller, CE Synthesis and pharmacological evaluation of coumarin derivatives as cannabinoid receptor antagonists and inverse agonists. Bioorg Med Chem17:2842-51 (2009) 
 
Cannabinoid receptor 2
Name:Cannabinoid receptor 2
Type:G Protein-Coupled Receptor (GPCR)
Mol. Mass.:39690.94
Organism:Homo sapiens (Human)
Description:P34972
Residue:360
BDBM50278426
NameBDBM50278426
Synonyms:5-methoxy-3-(2-methoxybenzyl)-7-methyl-2H-chromen-2-one | CHEMBL471248
TypeSmall organic molecule
Emp. Form.C19H18O4
Mol. Mass.310.3438
SMILESCOc1ccccc1Cc1cc2c(OC)cc(C)cc2oc1=O