Reaction Details
TargetCannabinoid receptor 2
LigandBDBM50278424
Substrate/Competitorn/a
Meas. Tech.ChEMBL_565045 (CHEMBL959188)
Ki 9390±n/a nM
Citation Behrenswerth, AVolz, NToräng, JHinz, SBräse, SMüller, CE Synthesis and pharmacological evaluation of coumarin derivatives as cannabinoid receptor antagonists and inverse agonists. Bioorg Med Chem17:2842-51 (2009) 
 
Cannabinoid receptor 2
Name:Cannabinoid receptor 2
Type:G Protein-Coupled Receptor (GPCR)
Mol. Mass.:39690.94
Organism:Homo sapiens (Human)
Description:P34972
Residue:360
BDBM50278424
NameBDBM50278424
Synonyms:3-(4-Chlorobenzyl)-5-methoxy-7-methyl-2H-chromen-2-one | CHEMBL513034
TypeSmall organic molecule
Emp. Form.C18H15ClO3
Mol. Mass.314.763
SMILESCOc1cc(C)cc2oc(=O)c(Cc3ccc(Cl)cc3)cc12