Reaction Details
TargetCannabinoid receptor 2
LigandBDBM50278378
Substrate/Competitorn/a
Meas. Tech.ChEMBL_565045 (CHEMBL959188)
Ki>10000±n/a nM
Citation Behrenswerth, AVolz, NToräng, JHinz, SBräse, SMüller, CE Synthesis and pharmacological evaluation of coumarin derivatives as cannabinoid receptor antagonists and inverse agonists. Bioorg Med Chem17:2842-51 (2009) 
 
Cannabinoid receptor 2
Name:Cannabinoid receptor 2
Type:G Protein-Coupled Receptor (GPCR)
Mol. Mass.:39690.94
Organism:Homo sapiens (Human)
Description:P34972
Residue:360
BDBM50278378
NameBDBM50278378
Synonyms:8-Methoxy-3-methylchromen-2-one | CHEMBL470198
TypeSmall organic molecule
Emp. Form.C11H10O3
Mol. Mass.190.1953
SMILESCOc1cccc2cc(C)c(=O)oc12