Reaction Details
TargetCannabinoid receptor 2
LigandBDBM50278258
Substrate/Competitorn/a
Meas. Tech.ChEMBL_565045 (CHEMBL959188)
Ki 2060±n/a nM
Citation Behrenswerth, AVolz, NToräng, JHinz, SBräse, SMüller, CE Synthesis and pharmacological evaluation of coumarin derivatives as cannabinoid receptor antagonists and inverse agonists. Bioorg Med Chem17:2842-51 (2009) 
 
Cannabinoid receptor 2
Name:Cannabinoid receptor 2
Type:G Protein-Coupled Receptor (GPCR)
Mol. Mass.:39690.94
Organism:Homo sapiens (Human)
Description:P34972
Residue:360
BDBM50278258
NameBDBM50278258
Synonyms:2-(2-Methoxybenzyl)-3H-benzo[f]chromen-3-one | CHEMBL469340
TypeSmall organic molecule
Emp. Form.C21H16O3
Mol. Mass.316.3499
SMILESCOc1ccccc1Cc1cc2c(ccc3ccccc23)oc1=O