Reaction Details
TargetCannabinoid receptor 2
LigandBDBM50278256
Substrate/Competitorn/a
Meas. Tech.ChEMBL_565045 (CHEMBL959188)
Ki>10000±n/a nM
Citation Behrenswerth, AVolz, NToräng, JHinz, SBräse, SMüller, CE Synthesis and pharmacological evaluation of coumarin derivatives as cannabinoid receptor antagonists and inverse agonists. Bioorg Med Chem17:2842-51 (2009) 
 
Cannabinoid receptor 2
Name:Cannabinoid receptor 2
Type:G Protein-Coupled Receptor (GPCR)
Mol. Mass.:39690.94
Organism:Homo sapiens (Human)
Description:P34972
Residue:360
BDBM50278256
NameBDBM50278256
Synonyms:3-Benzylchromen-2-one | CHEMBL472493
TypeSmall organic molecule
Emp. Form.C16H12O2
Mol. Mass.236.2653
SMILESO=c1oc2ccccc2cc1Cc1ccccc1