Reaction Details
TargetCannabinoid receptor 1
LigandBDBM50278518
Substrate/Competitorn/a
Meas. Tech.ChEMBL_565043 (CHEMBL959186)
Ki>10000±n/a nM
Citation Behrenswerth, AVolz, NToräng, JHinz, SBräse, SMüller, CE Synthesis and pharmacological evaluation of coumarin derivatives as cannabinoid receptor antagonists and inverse agonists. Bioorg Med Chem17:2842-51 (2009) 
 
Cannabinoid receptor 1
Name:Cannabinoid receptor 1
Type:G Protein-Coupled Receptor (GPCR)
Mol. Mass.:52856.55
Organism:Rattus norvegicus (rat)
Description:P20272
Residue:473
BDBM50278518
NameBDBM50278518
Synonyms:1-(8-bromo-5-methoxy-2-methyl-2H-chromen-3-yl)ethanone | CHEMBL453459
TypeSmall organic molecule
Emp. Form.C13H13BrO3
Mol. Mass.297.145
SMILESCOc1ccc(Br)c2OC(C)C(=Cc12)C(C)=O