Reaction Details
TargetCannabinoid receptor 1
LigandBDBM50278474
Substrate/Competitorn/a
Meas. Tech.ChEMBL_565043 (CHEMBL959186)
Ki>10000±n/a nM
Citation Behrenswerth, AVolz, NToräng, JHinz, SBräse, SMüller, CE Synthesis and pharmacological evaluation of coumarin derivatives as cannabinoid receptor antagonists and inverse agonists. Bioorg Med Chem17:2842-51 (2009) 
 
Cannabinoid receptor 1
Name:Cannabinoid receptor 1
Type:G Protein-Coupled Receptor (GPCR)
Mol. Mass.:52856.55
Organism:Rattus norvegicus (rat)
Description:P20272
Residue:473
BDBM50278474
NameBDBM50278474
Synonyms:3-Benzyl-8-bromo-5-methoxychromen-2-one | CHEMBL470019
TypeSmall organic molecule
Emp. Form.C17H13BrO3
Mol. Mass.345.187
SMILESCOc1ccc(Br)c2oc(=O)c(Cc3ccccc3)cc12