Reaction Details
TargetCannabinoid receptor 1
LigandBDBM50278471
Substrate/Competitorn/a
Meas. Tech.ChEMBL_565043 (CHEMBL959186)
Ki 6230±n/a nM
Citation Behrenswerth, AVolz, NToräng, JHinz, SBräse, SMüller, CE Synthesis and pharmacological evaluation of coumarin derivatives as cannabinoid receptor antagonists and inverse agonists. Bioorg Med Chem17:2842-51 (2009) 
 
Cannabinoid receptor 1
Name:Cannabinoid receptor 1
Type:G Protein-Coupled Receptor (GPCR)
Mol. Mass.:52856.55
Organism:Rattus norvegicus (rat)
Description:P20272
Residue:473
BDBM50278471
NameBDBM50278471
Synonyms:3-(2,4-Dimethoxybenzyl)-5-methoxy-7-methyl-2Hchromen-2-one | CHEMBL470016
TypeSmall organic molecule
Emp. Form.C20H20O5
Mol. Mass.340.3698
SMILESCOc1ccc(Cc2cc3c(OC)cc(C)cc3oc2=O)c(OC)c1