Reaction Details
TargetCannabinoid receptor 1
LigandBDBM50278429
Substrate/Competitorn/a
Meas. Tech.ChEMBL_565043 (CHEMBL959186)
Ki 9570±n/a nM
Citation Behrenswerth, AVolz, NToräng, JHinz, SBräse, SMüller, CE Synthesis and pharmacological evaluation of coumarin derivatives as cannabinoid receptor antagonists and inverse agonists. Bioorg Med Chem17:2842-51 (2009) 
 
Cannabinoid receptor 1
Name:Cannabinoid receptor 1
Type:G Protein-Coupled Receptor (GPCR)
Mol. Mass.:52856.55
Organism:Rattus norvegicus (rat)
Description:P20272
Residue:473
BDBM50278429
NameBDBM50278429
Synonyms:5-Methoxy-3-(2-methoxybenzyl)-2H-chromen-2-one | CHEMBL505327
TypeSmall organic molecule
Emp. Form.C18H16O4
Mol. Mass.296.3172
SMILESCOc1ccccc1Cc1cc2c(OC)cccc2oc1=O