Reaction Details
TargetCannabinoid receptor 1
LigandBDBM50278425
Substrate/Competitorn/a
Meas. Tech.ChEMBL_565043 (CHEMBL959186)
Ki 1100±n/a nM
Citation Behrenswerth, AVolz, NToräng, JHinz, SBräse, SMüller, CE Synthesis and pharmacological evaluation of coumarin derivatives as cannabinoid receptor antagonists and inverse agonists. Bioorg Med Chem17:2842-51 (2009) 
 
Cannabinoid receptor 1
Name:Cannabinoid receptor 1
Type:G Protein-Coupled Receptor (GPCR)
Mol. Mass.:52856.55
Organism:Rattus norvegicus (rat)
Description:P20272
Residue:473
BDBM50278425
NameBDBM50278425
Synonyms:3-(2-Hydroxybenzyl)-5-methoxy-7-methyl-2Hchromen-2-one | CHEMBL470212
TypeSmall organic molecule
Emp. Form.C18H16O4
Mol. Mass.296.3172
SMILESCOc1cc(C)cc2oc(=O)c(Cc3ccccc3O)cc12