Reaction Details
TargetCannabinoid receptor 1
LigandBDBM50278330
Substrate/Competitorn/a
Meas. Tech.ChEMBL_565043 (CHEMBL959186)
Ki>10000±n/a nM
Citation Behrenswerth, AVolz, NToräng, JHinz, SBräse, SMüller, CE Synthesis and pharmacological evaluation of coumarin derivatives as cannabinoid receptor antagonists and inverse agonists. Bioorg Med Chem17:2842-51 (2009) 
 
Cannabinoid receptor 1
Name:Cannabinoid receptor 1
Type:G Protein-Coupled Receptor (GPCR)
Mol. Mass.:52856.55
Organism:Rattus norvegicus (rat)
Description:P20272
Residue:473
BDBM50278330
NameBDBM50278330
Synonyms:3-Benzyl-6-nitrochromen-2-one | CHEMBL472635
TypeSmall organic molecule
Emp. Form.C16H11NO4
Mol. Mass.281.2628
SMILES[O-][N+](=O)c1ccc2oc(=O)c(Cc3ccccc3)cc2c1