Reaction Details
TargetKappa-type opioid receptor
LigandBDBM50278264
Substrate/Competitorn/a
Meas. Tech.ChEMBL_565194 (CHEMBL958400)
IC50 7800±n/a nM
Citation Wentland, MPLou, RLu, QBu, YDenhardt, CJin, JGanorkar, RVanAlstine, MAGuo, CCohen, DJBidlack, JM Syntheses of novel high affinity ligands for opioid receptors. Bioorg Med Chem Lett19:2289-94 (2009) 
 
Kappa-type opioid receptor
Name:Kappa-type opioid receptor
Type:G Protein-Coupled Receptor (GPCR)
Mol. Mass.:42648.76
Organism:Homo sapiens (Human)
Description:P41145
Residue:380
BDBM50278264
NameBDBM50278264
Synonyms:(1R,9R,10S)-4-carbamoyl-17-(cyclopropylmethyl)-3,10-dihydroxy-17-methyl-13-oxo-17-azatetracyclo[7.5.3.0^{1,10}.0^{2,7}]heptadeca-2(7),3,5-trien-17-ium iodide | CHEMBL511302
TypeSmall organic molecule
Emp. Form.C22H29N2O4
Mol. Mass.385.4761
SMILESC[N+]1(CC2CC2)CC[C@]23CC(=O)CC[C@@]2(O)[C@H]1Cc1ccc(C(N)=O)c(O)c31