Reaction Details
TargetMu-type opioid receptor
LigandBDBM50278383
Substrate/Competitorn/a
Meas. Tech.ChEMBL_564842 (CHEMBL955069)
Ki 0.160000±n/a nM
Citation Wentland, MPLou, RLu, QBu, YDenhardt, CJin, JGanorkar, RVanAlstine, MAGuo, CCohen, DJBidlack, JM Syntheses of novel high affinity ligands for opioid receptors. Bioorg Med Chem Lett19:2289-94 (2009) 
 
Mu-type opioid receptor
Name:Mu-type opioid receptor
Type:G Protein-Coupled Receptor (GPCR)
Mol. Mass.:44789.51
Organism:Homo sapiens (Human)
Description:P35372
Residue:400
BDBM50278383
NameBDBM50278383
Synonyms:(1S,9R,10S)-17-(cyclopropylmethyl)-3,10-dihydroxy-17-azatetracyclo[7.5.3.0^{1,10}.0^{2,7}]heptadeca-2(7),3,5-triene-4-carboxamide | CHEMBL470005
TypeSmall organic molecule
Emp. Form.C21H28N2O3
Mol. Mass.356.4586
SMILESNC(=O)c1ccc2C[C@H]3N(CC4CC4)CC[C@@]4(CCCC[C@@]34O)c2c1O