Reaction Details
TargetKappa-type opioid receptor
LigandBDBM50278386
Substrate/Competitorn/a
Meas. Tech.ChEMBL_564844 (CHEMBL955071)
Ki 2.3±n/a nM
Citation Wentland, MPLou, RLu, QBu, YDenhardt, CJin, JGanorkar, RVanAlstine, MAGuo, CCohen, DJBidlack, JM Syntheses of novel high affinity ligands for opioid receptors. Bioorg Med Chem Lett19:2289-94 (2009) 
 
Kappa-type opioid receptor
Name:Kappa-type opioid receptor
Type:G Protein-Coupled Receptor (GPCR)
Mol. Mass.:42648.76
Organism:Homo sapiens (Human)
Description:P41145
Residue:380
BDBM50278386
NameBDBM50278386
Synonyms:(1S,9R,10R)-3-hydroxy-17-methyl-13-oxo-17-azatetracyclo[7.5.3.0^{1,10}.0^{2,7}]heptadeca-2(7),3,5-triene-4-carboxamide | CHEMBL471048
TypeSmall organic molecule
Emp. Form.C18H22N2O3
Mol. Mass.314.3789
SMILESCN1CC[C@]23CC(=O)CC[C@H]2[C@H]1Cc1ccc(C(N)=O)c(O)c31