Reaction Details
TargetDelta-type opioid receptor
LigandBDBM50278212
Substrate/Competitorn/a
Meas. Tech.ChEMBL_564843 (CHEMBL955070)
Ki 150±n/a nM
Citation Wentland, MPLou, RLu, QBu, YDenhardt, CJin, JGanorkar, RVanAlstine, MAGuo, CCohen, DJBidlack, JM Syntheses of novel high affinity ligands for opioid receptors. Bioorg Med Chem Lett19:2289-94 (2009) 
 
Delta-type opioid receptor
Name:Delta-type opioid receptor
Type:G Protein-Coupled Receptor (GPCR)
Mol. Mass.:40382.98
Organism:Homo sapiens (Human)
Description:Competition binding assays were carried out using membrane preparations from transfected HN9.10 cells that constitutively expressed the delta opioid receptor.
Residue:372
BDBM50278212
NameBDBM50278212
Synonyms:(1S,5R,13R,14S,17S)-4-(cyclobutylmethyl)-14,17-dihydroxy-12-oxa-4-azapentacyclo[9.6.1.0^{1,13}.0^{5,17}.0^{7,18}]octadeca-7(18),8,10-triene-10-carboxamide | CHEMBL513762
TypeSmall organic molecule
Emp. Form.C22H28N2O4
Mol. Mass.384.4687
SMILESNC(=O)c1ccc2C[C@H]3N(CC4CCC4)CC[C@@]45[C@@H](Oc1c24)[C@@H](O)CC[C@@]35O