Reaction Details
TargetDelta-type opioid receptor
LigandBDBM50278263
Substrate/Competitorn/a
Meas. Tech.ChEMBL_564843 (CHEMBL955070)
Ki 3.9±n/a nM
Citation Wentland, MPLou, RLu, QBu, YDenhardt, CJin, JGanorkar, RVanAlstine, MAGuo, CCohen, DJBidlack, JM Syntheses of novel high affinity ligands for opioid receptors. Bioorg Med Chem Lett19:2289-94 (2009) 
 
Delta-type opioid receptor
Name:Delta-type opioid receptor
Type:G Protein-Coupled Receptor (GPCR)
Mol. Mass.:40382.98
Organism:Homo sapiens (Human)
Description:Competition binding assays were carried out using membrane preparations from transfected HN9.10 cells that constitutively expressed the delta opioid receptor.
Residue:372
BDBM50278263
NameBDBM50278263
Synonyms:(1R,9R,10S,13R)-17-(cyclobutylmethyl)-3,10,13-trihydroxy-17-azatetracyclo[7.5.3.0^{1,10}.0^{2,7}]heptadeca-2(7),3,5-triene-4-carboxamide US10231963, Table B.20 US10736890, Compound TABLE B.20 US11534436, Compound Table B.20 US9656961, Example 00137
TypeSmall organic molecule
Emp. Form.C22H30N2O4
Mol. Mass.386.4846
SMILESNC(=O)c1ccc2C[C@H]3N(CC4CCC4)CC[C@@]4(C[C@H](O)CC[C@@]34O)c2c1O