Reaction Details
TargetDelta-type opioid receptor
LigandBDBM50278265
Substrate/Competitorn/a
Meas. Tech.ChEMBL_564843 (CHEMBL955070)
Ki 2.6±n/a nM
Citation Wentland, MPLou, RLu, QBu, YDenhardt, CJin, JGanorkar, RVanAlstine, MAGuo, CCohen, DJBidlack, JM Syntheses of novel high affinity ligands for opioid receptors. Bioorg Med Chem Lett19:2289-94 (2009) 
 
Delta-type opioid receptor
Name:Delta-type opioid receptor
Type:G Protein-Coupled Receptor (GPCR)
Mol. Mass.:40382.98
Organism:Homo sapiens (Human)
Description:Competition binding assays were carried out using membrane preparations from transfected HN9.10 cells that constitutively expressed the delta opioid receptor.
Residue:372
BDBM50278265
NameBDBM50278265
Synonyms:CCDC 710249, HCl salt | CHEMBL471243
TypeSmall organic molecule
Emp. Form.C21H26N2O4
Mol. Mass.370.4421
SMILESNC(=O)c1ccc2C[C@H]3N(CC4CC4)CC[C@@]4(CC(=O)CC[C@@]34O)c2c1O