Reaction Details
TargetDelta-type opioid receptor
LigandBDBM50278387
Substrate/Competitorn/a
Meas. Tech.ChEMBL_564843 (CHEMBL955070)
Ki 260±n/a nM
Citation Wentland, MPLou, RLu, QBu, YDenhardt, CJin, JGanorkar, RVanAlstine, MAGuo, CCohen, DJBidlack, JM Syntheses of novel high affinity ligands for opioid receptors. Bioorg Med Chem Lett19:2289-94 (2009) 
 
Delta-type opioid receptor
Name:Delta-type opioid receptor
Type:G Protein-Coupled Receptor (GPCR)
Mol. Mass.:40382.98
Organism:Homo sapiens (Human)
Description:Competition binding assays were carried out using membrane preparations from transfected HN9.10 cells that constitutively expressed the delta opioid receptor.
Residue:372
BDBM50278387
NameBDBM50278387
Synonyms:(1S,5R,13R,17R)-4-methyl-14-oxo-12-oxa-4-azapentacyclo[9.6.1.0^{1,13}.0^{5,17}.0^{7,18}]octadeca-7(18),8,10-triene-10-carboxamide | CHEMBL471049
TypeSmall organic molecule
Emp. Form.C18H20N2O3
Mol. Mass.312.363
SMILESCN1CC[C@@]23[C@H]4Oc5c2c(C[C@@H]1[C@@H]3CCC4=O)ccc5C(N)=O