Reaction Details
TargetKappa-type opioid receptor
LigandBDBM50278337
Substrate/Competitorn/a
Meas. Tech.ChEMBL_564844 (CHEMBL955071)
Ki 6.3±n/a nM
Citation Wentland, MPLou, RLu, QBu, YDenhardt, CJin, JGanorkar, RVanAlstine, MAGuo, CCohen, DJBidlack, JM Syntheses of novel high affinity ligands for opioid receptors. Bioorg Med Chem Lett19:2289-94 (2009) 
 
Kappa-type opioid receptor
Name:Kappa-type opioid receptor
Type:G Protein-Coupled Receptor (GPCR)
Mol. Mass.:42648.76
Organism:Homo sapiens (Human)
Description:P41145
Residue:380
BDBM50278337
NameBDBM50278337
Synonyms:CHEMBL470617 | Naltrexone methiodide
TypeSmall organic molecule
Emp. Form.C21H26NO4
Mol. Mass.356.4349
SMILESC[N+]1(CC2CC2)CC[C@@]23[C@H]4Oc5c2c(C[C@@H]1[C@]3(O)CCC4=O)ccc5O