Reaction Details
TargetKappa-type opioid receptor
LigandBDBM50105085
Substrate/Competitorn/a
Meas. Tech.ChEMBL_564844 (CHEMBL955071)
Ki 3±n/a nM
Citation Wentland, MPLou, RLu, QBu, YDenhardt, CJin, JGanorkar, RVanAlstine, MAGuo, CCohen, DJBidlack, JM Syntheses of novel high affinity ligands for opioid receptors. Bioorg Med Chem Lett19:2289-94 (2009) 
 
Kappa-type opioid receptor
Name:Kappa-type opioid receptor
Type:G Protein-Coupled Receptor (GPCR)
Mol. Mass.:42648.76
Organism:Homo sapiens (Human)
Description:P41145
Residue:380
BDBM50105085
NameBDBM50105085
Synonyms:17-cyclobutylmethyl-4,5alpha-epoxymorphinan-3,6alpha,14-triol N-cyclobutylmethyl-4,5alpha-epoxy-3,6alpha,14-morphinantriol US10231963, Table B.1 US11534436, Compound Table B.1 US9656961, Example 00118 | USRE49340, Rank 9
TypeSmall organic molecule
Emp. Form.C21H27NO4
Mol. Mass.357.4434
SMILESO[C@H]1CC[C@@]2(O)[C@H]3Cc4ccc(O)c5O[C@@H]1[C@]2(CCN3CC1CCC1)c45