Reaction Details
TargetMu-type opioid receptor
LigandBDBM50278437
Substrate/Competitorn/a
Meas. Tech.ChEMBL_565185 (CHEMBL958391)
Ki 46±n/a nM
Citation Wentland, MPLou, RLu, QBu, YDenhardt, CJin, JGanorkar, RVanAlstine, MAGuo, CCohen, DJBidlack, JM Syntheses of novel high affinity ligands for opioid receptors. Bioorg Med Chem Lett19:2289-94 (2009) 
 
Mu-type opioid receptor
Name:Mu-type opioid receptor
Type:G Protein-Coupled Receptor (GPCR)
Mol. Mass.:44789.51
Organism:Homo sapiens (Human)
Description:P35372
Residue:400
BDBM50278437
NameBDBM50278437
Synonyms:(1S,2S,13R,21R)-22-(cyclopropylmethyl)-2-hydroxy-14-oxa-11,22-diazaheptacyclo[13.9.1.0^{1,13}.0^{2,21}.0^{4,12}.0^{5,10}.0^{19,25}]pentacosa-4(12),5(10),6,8,15,17,19(25)-heptaene-16-carboxamide | CHEMBL511795
TypeSmall organic molecule
Emp. Form.C27H27N3O3
Mol. Mass.441.5216
SMILESNC(=O)c1ccc2C[C@H]3N(CC4CC4)CC[C@@]45[C@@H](Oc1c24)c1[nH]c2ccccc2c1C[C@@]35O